{"text_format":"1","workbook":"xlsx","n_sheets":2,"sheets":["TABLA","Hoja1"],"not_rendered":{"charts":0,"images":1,"macros":1,"external_links":0,"defined_names":5,"comments":0,"pivot_tables":0},"unopened":[],"bounds":{"document_bytes":16777216,"sheet_cells":100000,"rows_first":2000,"rows_last":500,"rows_between":2000,"halvings":0,"cell_chars":16384,"cell_head_chars":4096},"cells_cut":0,"cells_raw":0,"read":"whole","date_system":"1900"}

{"sheet":"TABLA","index":0,"n_rows":1006,"n_cols":16,"rows_kept":1006,"cut":false,"hidden":false,"merged":[[4,0,4,13],[5,0,5,2]]}
[]
[]
[]
[]
["Tabla coste horario de personal propio"]
["Datos generales del trabajador",null,null,null,null,null,null,"Datos de dedicación a la propuesta de actividades"]
["Nº Orden ","NIF del trabajador","Apellidos y nombre del trabajador","Grupo profesional del trabajador","% de jornada","% aportación SS empresa","Tarifa horaria con SS o sin SS (EUR/h)","Nº de horas dedicadas a la propuesta","Coste total imputado","Actividades realizadas por el trabajador","Tipología de la actividad","Límite anexo","Mes de realización de la actividad (MM/AAAA)","Observaciones"]
[null,null,null,null,null,null,null,null,null,null,null,null,null,null,{"$f":"IFERROR(VLOOKUP(D8,Hoja1!$A$3:$B$7,2,FALSE),\"\")","v":""},{"$f":"IFERROR(VLOOKUP(K8,Hoja1!$A$10:$B$12,2,FALSE),\"\")","v":""}]
[null,null,null,null,null,null,null,null,null,null,null,null,null,null,{"$f":"IFERROR(VLOOKUP(D9,Hoja1!$A$3:$B$7,2,FALSE),\"\")","v":""},{"$f":"IFERROR(VLOOKUP(K9,Hoja1!$A$10:$B$12,2,FALSE),\"\")","v":""}]
[null,null,null,null,null,null,null,null,null,null,null,null,null,null,{"$f":"IFERROR(VLOOKUP(D10,Hoja1!$A$3:$B$7,2,FALSE),\"\")","v":""},{"$f":"IFERROR(VLOOKUP(K10,Hoja1!$A$10:$B$12,2,FALSE),\"\")","v":""}]
[null,null,null,null,null,null,null,null,null,null,null,null,null,null,{"$f":"IFERROR(VLOOKUP(D11,Hoja1!$A$3:$B$7,2,FALSE),\"\")","v":""},{"$f":"IFERROR(VLOOKUP(K11,Hoja1!$A$10:$B$12,2,FALSE),\"\")","v":""}]
[null,null,null,null,null,null,null,null,null,null,null,null,null,null,{"$f":"IFERROR(VLOOKUP(D12,Hoja1!$A$3:$B$7,2,FALSE),\"\")","v":""},{"$f":"IFERROR(VLOOKUP(K12,Hoja1!$A$10:$B$12,2,FALSE),\"\")","v":""}]
[null,null,null,null,null,null,null,null,null,null,null,null,null,null,{"$f":"IFERROR(VLOOKUP(D13,Hoja1!$A$3:$B$7,2,FALSE),\"\")","v":""},{"$f":"IFERROR(VLOOKUP(K13,Hoja1!$A$10:$B$12,2,FALSE),\"\")","v":""}]
[null,null,null,null,null,null,null,null,null,null,null,null,null,null,{"$f":"IFERROR(VLOOKUP(D14,Hoja1!$A$3:$B$7,2,FALSE),\"\")","v":""},{"$f":"IFERROR(VLOOKUP(K14,Hoja1!$A$10:$B$12,2,FALSE),\"\")","v":""}]
[null,null,null,null,null,null,null,null,null,null,null,null,null,null,{"$f":"IFERROR(VLOOKUP(D15,Hoja1!$A$3:$B$7,2,FALSE),\"\")","v":""},{"$f":"IFERROR(VLOOKUP(K15,Hoja1!$A$10:$B$12,2,FALSE),\"\")","v":""}]
[null,null,null,null,null,null,null,null,null,null,null,null,null,null,{"$f":"IFERROR(VLOOKUP(D16,Hoja1!$A$3:$B$7,2,FALSE),\"\")","v":""},{"$f":"IFERROR(VLOOKUP(K16,Hoja1!$A$10:$B$12,2,FALSE),\"\")","v":""}]
[null,null,null,null,null,null,null,null,null,null,null,null,null,null,{"$f":"IFERROR(VLOOKUP(D17,Hoja1!$A$3:$B$7,2,FALSE),\"\")","v":""},{"$f":"IFERROR(VLOOKUP(K17,Hoja1!$A$10:$B$12,2,FALSE),\"\")","v":""}]
[null,null,null,null,null,null,null,null,null,null,null,null,null,null,{"$f":"IFERROR(VLOOKUP(D18,Hoja1!$A$3:$B$7,2,FALSE),\"\")","v":""},{"$f":"IFERROR(VLOOKUP(K18,Hoja1!$A$10:$B$12,2,FALSE),\"\")","v":""}]
[null,null,null,null,null,null,null,null,null,null,null,null,null,null,{"$f":"IFERROR(VLOOKUP(D19,Hoja1!$A$3:$B$7,2,FALSE),\"\")","v":""},{"$f":"IFERROR(VLOOKUP(K19,Hoja1!$A$10:$B$12,2,FALSE),\"\")","v":""}]
[null,null,null,null,null,null,null,null,null,null,null,null,null,null,{"$f":"IFERROR(VLOOKUP(D20,Hoja1!$A$3:$B$7,2,FALSE),\"\")","v":""},{"$f":"IFERROR(VLOOKUP(K20,Hoja1!$A$10:$B$12,2,FALSE),\"\")","v":""}]
[null,null,null,null,null,null,null,null,null,null,null,null,null,null,{"$f":"IFERROR(VLOOKUP(D21,Hoja1!$A$3:$B$7,2,FALSE),\"\")","v":""},{"$f":"IFERROR(VLOOKUP(K21,Hoja1!$A$10:$B$12,2,FALSE),\"\")","v":""}]
[null,null,null,null,null,null,null,null,null,null,null,null,null,null,{"$f":"IFERROR(VLOOKUP(D22,Hoja1!$A$3:$B$7,2,FALSE),\"\")","v":""},{"$f":"IFERROR(VLOOKUP(K22,Hoja1!$A$10:$B$12,2,FALSE),\"\")","v":""}]
[null,null,null,null,null,null,null,null,null,null,null,null,null,null,{"$f":"IFERROR(VLOOKUP(D23,Hoja1!$A$3:$B$7,2,FALSE),\"\")","v":""},{"$f":"IFERROR(VLOOKUP(K23,Hoja1!$A$10:$B$12,2,FALSE),\"\")","v":""}]
[null,null,null,null,null,null,null,null,null,null,null,null,null,null,{"$f":"IFERROR(VLOOKUP(D24,Hoja1!$A$3:$B$7,2,FALSE),\"\")","v":""},{"$f":"IFERROR(VLOOKUP(K24,Hoja1!$A$10:$B$12,2,FALSE),\"\")","v":""}]
[null,null,null,null,null,null,null,null,null,null,null,null,null,null,{"$f":"IFERROR(VLOOKUP(D25,Hoja1!$A$3:$B$7,2,FALSE),\"\")","v":""},{"$f":"IFERROR(VLOOKUP(K25,Hoja1!$A$10:$B$12,2,FALSE),\"\")","v":""}]
[null,null,null,null,null,null,null,null,null,null,null,null,null,null,{"$f":"IFERROR(VLOOKUP(D26,Hoja1!$A$3:$B$7,2,FALSE),\"\")","v":""},{"$f":"IFERROR(VLOOKUP(K26,Hoja1!$A$10:$B$12,2,FALSE),\"\")","v":""}]
[null,null,null,null,null,null,null,null,null,null,null,null,null,null,{"$f":"IFERROR(VLOOKUP(D27,Hoja1!$A$3:$B$7,2,FALSE),\"\")","v":""},{"$f":"IFERROR(VLOOKUP(K27,Hoja1!$A$10:$B$12,2,FALSE),\"\")","v":""}]
[null,null,null,null,null,null,null,null,null,null,null,null,null,null,{"$f":"IFERROR(VLOOKUP(D28,Hoja1!$A$3:$B$7,2,FALSE),\"\")","v":""},{"$f":"IFERROR(VLOOKUP(K28,Hoja1!$A$10:$B$12,2,FALSE),\"\")","v":""}]
[null,null,null,null,null,null,null,null,null,null,null,null,null,null,{"$f":"IFERROR(VLOOKUP(D29,Hoja1!$A$3:$B$7,2,FALSE),\"\")","v":""},{"$f":"IFERROR(VLOOKUP(K29,Hoja1!$A$10:$B$12,2,FALSE),\"\")","v":""}]
[null,null,null,null,null,null,null,null,null,null,null,null,null,null,{"$f":"IFERROR(VLOOKUP(D30,Hoja1!$A$3:$B$7,2,FALSE),\"\")","v":""},{"$f":"IFERROR(VLOOKUP(K30,Hoja1!$A$10:$B$12,2,FALSE),\"\")","v":""}]
[null,null,null,null,null,null,null,null,null,null,null,null,null,null,{"$f":"IFERROR(VLOOKUP(D31,Hoja1!$A$3:$B$7,2,FALSE),\"\")","v":""},{"$f":"IFERROR(VLOOKUP(K31,Hoja1!$A$10:$B$12,2,FALSE),\"\")","v":""}]
[null,null,null,null,null,null,null,null,null,null,null,null,null,null,{"$f":"IFERROR(VLOOKUP(D32,Hoja1!$A$3:$B$7,2,FALSE),\"\")","v":""},{"$f":"IFERROR(VLOOKUP(K32,Hoja1!$A$10:$B$12,2,FALSE),\"\")","v":""}]
[null,null,null,null,null,null,null,null,null,null,null,null,null,null,{"$f":"IFERROR(VLOOKUP(D33,Hoja1!$A$3:$B$7,2,FALSE),\"\")","v":""},{"$f":"IFERROR(VLOOKUP(K33,Hoja1!$A$10:$B$12,2,FALSE),\"\")","v":""}]
[null,null,null,null,null,null,null,null,null,null,null,null,null,null,{"$f":"IFERROR(VLOOKUP(D34,Hoja1!$A$3:$B$7,2,FALSE),\"\")","v":""},{"$f":"IFERROR(VLOOKUP(K34,Hoja1!$A$10:$B$12,2,FALSE),\"\")","v":""}]
[null,null,null,null,null,null,null,null,null,null,null,null,null,null,{"$f":"IFERROR(VLOOKUP(D35,Hoja1!$A$3:$B$7,2,FALSE),\"\")","v":""},{"$f":"IFERROR(VLOOKUP(K35,Hoja1!$A$10:$B$12,2,FALSE),\"\")","v":""}]
[null,null,null,null,null,null,null,null,null,null,null,null,null,null,{"$f":"IFERROR(VLOOKUP(D36,Hoja1!$A$3:$B$7,2,FALSE),\"\")","v":""},{"$f":"IFERROR(VLOOKUP(K36,Hoja1!$A$10:$B$12,2,FALSE),\"\")","v":""}]
[null,null,null,null,null,null,null,null,null,null,null,null,null,null,{"$f":"IFERROR(VLOOKUP(D37,Hoja1!$A$3:$B$7,2,FALSE),\"\")","v":""},{"$f":"IFERROR(VLOOKUP(K37,Hoja1!$A$10:$B$12,2,FALSE),\"\")","v":""}]
[null,null,null,null,null,null,null,null,null,null,null,null,null,null,{"$f":"IFERROR(VLOOKUP(D38,Hoja1!$A$3:$B$7,2,FALSE),\"\")","v":""},{"$f":"IFERROR(VLOOKUP(K38,Hoja1!$A$10:$B$12,2,FALSE),\"\")","v":""}]
[null,null,null,null,null,null,null,null,null,null,null,null,null,null,{"$f":"IFERROR(VLOOKUP(D39,Hoja1!$A$3:$B$7,2,FALSE),\"\")","v":""},{"$f":"IFERROR(VLOOKUP(K39,Hoja1!$A$10:$B$12,2,FALSE),\"\")","v":""}]
[null,null,null,null,null,null,null,null,null,null,null,null,null,null,{"$f":"IFERROR(VLOOKUP(D40,Hoja1!$A$3:$B$7,2,FALSE),\"\")","v":""},{"$f":"IFERROR(VLOOKUP(K40,Hoja1!$A$10:$B$12,2,FALSE),\"\")","v":""}]
[null,null,null,null,null,null,null,null,null,null,null,null,null,null,{"$f":"IFERROR(VLOOKUP(D41,Hoja1!$A$3:$B$7,2,FALSE),\"\")","v":""},{"$f":"IFERROR(VLOOKUP(K41,Hoja1!$A$10:$B$12,2,FALSE),\"\")","v":""}]
[null,null,null,null,null,null,null,null,null,null,null,null,null,null,{"$f":"IFERROR(VLOOKUP(D42,Hoja1!$A$3:$B$7,2,FALSE),\"\")","v":""},{"$f":"IFERROR(VLOOKUP(K42,Hoja1!$A$10:$B$12,2,FALSE),\"\")","v":""}]
[null,null,null,null,null,null,null,null,null,null,null,null,null,null,{"$f":"IFERROR(VLOOKUP(D43,Hoja1!$A$3:$B$7,2,FALSE),\"\")","v":""},{"$f":"IFERROR(VLOOKUP(K43,Hoja1!$A$10:$B$12,2,FALSE),\"\")","v":""}]
[null,null,null,null,null,null,null,null,null,null,null,null,null,null,{"$f":"IFERROR(VLOOKUP(D44,Hoja1!$A$3:$B$7,2,FALSE),\"\")","v":""},{"$f":"IFERROR(VLOOKUP(K44,Hoja1!$A$10:$B$12,2,FALSE),\"\")","v":""}]
[null,null,null,null,null,null,null,null,null,null,null,null,null,null,{"$f":"IFERROR(VLOOKUP(D45,Hoja1!$A$3:$B$7,2,FALSE),\"\")","v":""},{"$f":"IFERROR(VLOOKUP(K45,Hoja1!$A$10:$B$12,2,FALSE),\"\")","v":""}]
[null,null,null,null,null,null,null,null,null,null,null,null,null,null,{"$f":"IFERROR(VLOOKUP(D46,Hoja1!$A$3:$B$7,2,FALSE),\"\")","v":""},{"$f":"IFERROR(VLOOKUP(K46,Hoja1!$A$10:$B$12,2,FALSE),\"\")","v":""}]
[null,null,null,null,null,null,null,null,null,null,null,null,null,null,{"$f":"IFERROR(VLOOKUP(D47,Hoja1!$A$3:$B$7,2,FALSE),\"\")","v":""},{"$f":"IFERROR(VLOOKUP(K47,Hoja1!$A$10:$B$12,2,FALSE),\"\")","v":""}]
[null,null,null,null,null,null,null,null,null,null,null,null,null,null,{"$f":"IFERROR(VLOOKUP(D48,Hoja1!$A$3:$B$7,2,FALSE),\"\")","v":""},{"$f":"IFERROR(VLOOKUP(K48,Hoja1!$A$10:$B$12,2,FALSE),\"\")","v":""}]
[null,null,null,null,null,null,null,null,null,null,null,null,null,null,{"$f":"IFERROR(VLOOKUP(D49,Hoja1!$A$3:$B$7,2,FALSE),\"\")","v":""},{"$f":"IFERROR(VLOOKUP(K49,Hoja1!$A$10:$B$12,2,FALSE),\"\")","v":""}]
[null,null,null,null,null,null,null,null,null,null,null,null,null,null,{"$f":"IFERROR(VLOOKUP(D50,Hoja1!$A$3:$B$7,2,FALSE),\"\")","v":""},{"$f":"IFERROR(VLOOKUP(K50,Hoja1!$A$10:$B$12,2,FALSE),\"\")","v":""}]
[null,null,null,null,null,null,null,null,null,null,null,null,null,null,{"$f":"IFERROR(VLOOKUP(D51,Hoja1!$A$3:$B$7,2,FALSE),\"\")","v":""},{"$f":"IFERROR(VLOOKUP(K51,Hoja1!$A$10:$B$12,2,FALSE),\"\")","v":""}]
[null,null,null,null,null,null,null,null,null,null,null,null,null,null,{"$f":"IFERROR(VLOOKUP(D52,Hoja1!$A$3:$B$7,2,FALSE),\"\")","v":""},{"$f":"IFERROR(VLOOKUP(K52,Hoja1!$A$10:$B$12,2,FALSE),\"\")","v":""}]
[null,null,null,null,null,null,null,null,null,null,null,null,null,null,{"$f":"IFERROR(VLOOKUP(D53,Hoja1!$A$3:$B$7,2,FALSE),\"\")","v":""},{"$f":"IFERROR(VLOOKUP(K53,Hoja1!$A$10:$B$12,2,FALSE),\"\")","v":""}]
[null,null,null,null,null,null,null,null,null,null,null,null,null,null,{"$f":"IFERROR(VLOOKUP(D54,Hoja1!$A$3:$B$7,2,FALSE),\"\")","v":""},{"$f":"IFERROR(VLOOKUP(K54,Hoja1!$A$10:$B$12,2,FALSE),\"\")","v":""}]
[null,null,null,null,null,null,null,null,null,null,null,null,null,null,{"$f":"IFERROR(VLOOKUP(D55,Hoja1!$A$3:$B$7,2,FALSE),\"\")","v":""},{"$f":"IFERROR(VLOOKUP(K55,Hoja1!$A$10:$B$12,2,FALSE),\"\")","v":""}]
[null,null,null,null,null,null,null,null,null,null,null,null,null,null,{"$f":"IFERROR(VLOOKUP(D56,Hoja1!$A$3:$B$7,2,FALSE),\"\")","v":""},{"$f":"IFERROR(VLOOKUP(K56,Hoja1!$A$10:$B$12,2,FALSE),\"\")","v":""}]
[null,null,null,null,null,null,null,null,null,null,null,null,null,null,{"$f":"IFERROR(VLOOKUP(D57,Hoja1!$A$3:$B$7,2,FALSE),\"\")","v":""},{"$f":"IFERROR(VLOOKUP(K57,Hoja1!$A$10:$B$12,2,FALSE),\"\")","v":""}]
[null,null,null,null,null,null,null,null,null,null,null,null,null,null,{"$f":"IFERROR(VLOOKUP(D58,Hoja1!$A$3:$B$7,2,FALSE),\"\")","v":""},{"$f":"IFERROR(VLOOKUP(K58,Hoja1!$A$10:$B$12,2,FALSE),\"\")","v":""}]
[null,null,null,null,null,null,null,null,null,null,null,null,null,null,{"$f":"IFERROR(VLOOKUP(D59,Hoja1!$A$3:$B$7,2,FALSE),\"\")","v":""},{"$f":"IFERROR(VLOOKUP(K59,Hoja1!$A$10:$B$12,2,FALSE),\"\")","v":""}]
[null,null,null,null,null,null,null,null,null,null,null,null,null,null,{"$f":"IFERROR(VLOOKUP(D60,Hoja1!$A$3:$B$7,2,FALSE),\"\")","v":""},{"$f":"IFERROR(VLOOKUP(K60,Hoja1!$A$10:$B$12,2,FALSE),\"\")","v":""}]
[null,null,null,null,null,null,null,null,null,null,null,null,null,null,{"$f":"IFERROR(VLOOKUP(D61,Hoja1!$A$3:$B$7,2,FALSE),\"\")","v":""},{"$f":"IFERROR(VLOOKUP(K61,Hoja1!$A$10:$B$12,2,FALSE),\"\")","v":""}]
[null,null,null,null,null,null,null,null,null,null,null,null,null,null,{"$f":"IFERROR(VLOOKUP(D62,Hoja1!$A$3:$B$7,2,FALSE),\"\")","v":""},{"$f":"IFERROR(VLOOKUP(K62,Hoja1!$A$10:$B$12,2,FALSE),\"\")","v":""}]
[null,null,null,null,null,null,null,null,null,null,null,null,null,null,{"$f":"IFERROR(VLOOKUP(D63,Hoja1!$A$3:$B$7,2,FALSE),\"\")","v":""},{"$f":"IFERROR(VLOOKUP(K63,Hoja1!$A$10:$B$12,2,FALSE),\"\")","v":""}]
[null,null,null,null,null,null,null,null,null,null,null,null,null,null,{"$f":"IFERROR(VLOOKUP(D64,Hoja1!$A$3:$B$7,2,FALSE),\"\")","v":""},{"$f":"IFERROR(VLOOKUP(K64,Hoja1!$A$10:$B$12,2,FALSE),\"\")","v":""}]
[null,null,null,null,null,null,null,null,null,null,null,null,null,null,{"$f":"IFERROR(VLOOKUP(D65,Hoja1!$A$3:$B$7,2,FALSE),\"\")","v":""},{"$f":"IFERROR(VLOOKUP(K65,Hoja1!$A$10:$B$12,2,FALSE),\"\")","v":""}]
[null,null,null,null,null,null,null,null,null,null,null,null,null,null,{"$f":"IFERROR(VLOOKUP(D66,Hoja1!$A$3:$B$7,2,FALSE),\"\")","v":""},{"$f":"IFERROR(VLOOKUP(K66,Hoja1!$A$10:$B$12,2,FALSE),\"\")","v":""}]
[null,null,null,null,null,null,null,null,null,null,null,null,null,null,{"$f":"IFERROR(VLOOKUP(D67,Hoja1!$A$3:$B$7,2,FALSE),\"\")","v":""},{"$f":"IFERROR(VLOOKUP(K67,Hoja1!$A$10:$B$12,2,FALSE),\"\")","v":""}]
[null,null,null,null,null,null,null,null,null,null,null,null,null,null,{"$f":"IFERROR(VLOOKUP(D68,Hoja1!$A$3:$B$7,2,FALSE),\"\")","v":""},{"$f":"IFERROR(VLOOKUP(K68,Hoja1!$A$10:$B$12,2,FALSE),\"\")","v":""}]
[null,null,null,null,null,null,null,null,null,null,null,null,null,null,{"$f":"IFERROR(VLOOKUP(D69,Hoja1!$A$3:$B$7,2,FALSE),\"\")","v":""},{"$f":"IFERROR(VLOOKUP(K69,Hoja1!$A$10:$B$12,2,FALSE),\"\")","v":""}]
[null,null,null,null,null,null,null,null,null,null,null,null,null,null,{"$f":"IFERROR(VLOOKUP(D70,Hoja1!$A$3:$B$7,2,FALSE),\"\")","v":""},{"$f":"IFERROR(VLOOKUP(K70,Hoja1!$A$10:$B$12,2,FALSE),\"\")","v":""}]
[null,null,null,null,null,null,null,null,null,null,null,null,null,null,{"$f":"IFERROR(VLOOKUP(D71,Hoja1!$A$3:$B$7,2,FALSE),\"\")","v":""},{"$f":"IFERROR(VLOOKUP(K71,Hoja1!$A$10:$B$12,2,FALSE),\"\")","v":""}]
[null,null,null,null,null,null,null,null,null,null,null,null,null,null,{"$f":"IFERROR(VLOOKUP(D72,Hoja1!$A$3:$B$7,2,FALSE),\"\")","v":""},{"$f":"IFERROR(VLOOKUP(K72,Hoja1!$A$10:$B$12,2,FALSE),\"\")","v":""}]
[null,null,null,null,null,null,null,null,null,null,null,null,null,null,{"$f":"IFERROR(VLOOKUP(D73,Hoja1!$A$3:$B$7,2,FALSE),\"\")","v":""},{"$f":"IFERROR(VLOOKUP(K73,Hoja1!$A$10:$B$12,2,FALSE),\"\")","v":""}]
[null,null,null,null,null,null,null,null,null,null,null,null,null,null,{"$f":"IFERROR(VLOOKUP(D74,Hoja1!$A$3:$B$7,2,FALSE),\"\")","v":""},{"$f":"IFERROR(VLOOKUP(K74,Hoja1!$A$10:$B$12,2,FALSE),\"\")","v":""}]
[null,null,null,null,null,null,null,null,null,null,null,null,null,null,{"$f":"IFERROR(VLOOKUP(D75,Hoja1!$A$3:$B$7,2,FALSE),\"\")","v":""},{"$f":"IFERROR(VLOOKUP(K75,Hoja1!$A$10:$B$12,2,FALSE),\"\")","v":""}]
[null,null,null,null,null,null,null,null,null,null,null,null,null,null,{"$f":"IFERROR(VLOOKUP(D76,Hoja1!$A$3:$B$7,2,FALSE),\"\")","v":""},{"$f":"IFERROR(VLOOKUP(K76,Hoja1!$A$10:$B$12,2,FALSE),\"\")","v":""}]
[null,null,null,null,null,null,null,null,null,null,null,null,null,null,{"$f":"IFERROR(VLOOKUP(D77,Hoja1!$A$3:$B$7,2,FALSE),\"\")","v":""},{"$f":"IFERROR(VLOOKUP(K77,Hoja1!$A$10:$B$12,2,FALSE),\"\")","v":""}]
[null,null,null,null,null,null,null,null,null,null,null,null,null,null,{"$f":"IFERROR(VLOOKUP(D78,Hoja1!$A$3:$B$7,2,FALSE),\"\")","v":""},{"$f":"IFERROR(VLOOKUP(K78,Hoja1!$A$10:$B$12,2,FALSE),\"\")","v":""}]
[null,null,null,null,null,null,null,null,null,null,null,null,null,null,{"$f":"IFERROR(VLOOKUP(D79,Hoja1!$A$3:$B$7,2,FALSE),\"\")","v":""},{"$f":"IFERROR(VLOOKUP(K79,Hoja1!$A$10:$B$12,2,FALSE),\"\")","v":""}]
[null,null,null,null,null,null,null,null,null,null,null,null,null,null,{"$f":"IFERROR(VLOOKUP(D80,Hoja1!$A$3:$B$7,2,FALSE),\"\")","v":""},{"$f":"IFERROR(VLOOKUP(K80,Hoja1!$A$10:$B$12,2,FALSE),\"\")","v":""}]
[null,null,null,null,null,null,null,null,null,null,null,null,null,null,{"$f":"IFERROR(VLOOKUP(D81,Hoja1!$A$3:$B$7,2,FALSE),\"\")","v":""},{"$f":"IFERROR(VLOOKUP(K81,Hoja1!$A$10:$B$12,2,FALSE),\"\")","v":""}]
[null,null,null,null,null,null,null,null,null,null,null,null,null,null,{"$f":"IFERROR(VLOOKUP(D82,Hoja1!$A$3:$B$7,2,FALSE),\"\")","v":""},{"$f":"IFERROR(VLOOKUP(K82,Hoja1!$A$10:$B$12,2,FALSE),\"\")","v":""}]
[null,null,null,null,null,null,null,null,null,null,null,null,null,null,{"$f":"IFERROR(VLOOKUP(D83,Hoja1!$A$3:$B$7,2,FALSE),\"\")","v":""},{"$f":"IFERROR(VLOOKUP(K83,Hoja1!$A$10:$B$12,2,FALSE),\"\")","v":""}]
[null,null,null,null,null,null,null,null,null,null,null,null,null,null,{"$f":"IFERROR(VLOOKUP(D84,Hoja1!$A$3:$B$7,2,FALSE),\"\")","v":""},{"$f":"IFERROR(VLOOKUP(K84,Hoja1!$A$10:$B$12,2,FALSE),\"\")","v":""}]
[null,null,null,null,null,null,null,null,null,null,null,null,null,null,{"$f":"IFERROR(VLOOKUP(D85,Hoja1!$A$3:$B$7,2,FALSE),\"\")","v":""},{"$f":"IFERROR(VLOOKUP(K85,Hoja1!$A$10:$B$12,2,FALSE),\"\")","v":""}]
[null,null,null,null,null,null,null,null,null,null,null,null,null,null,{"$f":"IFERROR(VLOOKUP(D86,Hoja1!$A$3:$B$7,2,FALSE),\"\")","v":""},{"$f":"IFERROR(VLOOKUP(K86,Hoja1!$A$10:$B$12,2,FALSE),\"\")","v":""}]
[null,null,null,null,null,null,null,null,null,null,null,null,null,null,{"$f":"IFERROR(VLOOKUP(D87,Hoja1!$A$3:$B$7,2,FALSE),\"\")","v":""},{"$f":"IFERROR(VLOOKUP(K87,Hoja1!$A$10:$B$12,2,FALSE),\"\")","v":""}]
[null,null,null,null,null,null,null,null,null,null,null,null,null,null,{"$f":"IFERROR(VLOOKUP(D88,Hoja1!$A$3:$B$7,2,FALSE),\"\")","v":""},{"$f":"IFERROR(VLOOKUP(K88,Hoja1!$A$10:$B$12,2,FALSE),\"\")","v":""}]
[null,null,null,null,null,null,null,null,null,null,null,null,null,null,{"$f":"IFERROR(VLOOKUP(D89,Hoja1!$A$3:$B$7,2,FALSE),\"\")","v":""},{"$f":"IFERROR(VLOOKUP(K89,Hoja1!$A$10:$B$12,2,FALSE),\"\")","v":""}]
[null,null,null,null,null,null,null,null,null,null,null,null,null,null,{"$f":"IFERROR(VLOOKUP(D90,Hoja1!$A$3:$B$7,2,FALSE),\"\")","v":""},{"$f":"IFERROR(VLOOKUP(K90,Hoja1!$A$10:$B$12,2,FALSE),\"\")","v":""}]
[null,null,null,null,null,null,null,null,null,null,null,null,null,null,{"$f":"IFERROR(VLOOKUP(D91,Hoja1!$A$3:$B$7,2,FALSE),\"\")","v":""},{"$f":"IFERROR(VLOOKUP(K91,Hoja1!$A$10:$B$12,2,FALSE),\"\")","v":""}]
[null,null,null,null,null,null,null,null,null,null,null,null,null,null,{"$f":"IFERROR(VLOOKUP(D92,Hoja1!$A$3:$B$7,2,FALSE),\"\")","v":""},{"$f":"IFERROR(VLOOKUP(K92,Hoja1!$A$10:$B$12,2,FALSE),\"\")","v":""}]
[null,null,null,null,null,null,null,null,null,null,null,null,null,null,{"$f":"IFERROR(VLOOKUP(D93,Hoja1!$A$3:$B$7,2,FALSE),\"\")","v":""},{"$f":"IFERROR(VLOOKUP(K93,Hoja1!$A$10:$B$12,2,FALSE),\"\")","v":""}]
[null,null,null,null,null,null,null,null,null,null,null,null,null,null,{"$f":"IFERROR(VLOOKUP(D94,Hoja1!$A$3:$B$7,2,FALSE),\"\")","v":""},{"$f":"IFERROR(VLOOKUP(K94,Hoja1!$A$10:$B$12,2,FALSE),\"\")","v":""}]
[null,null,null,null,null,null,null,null,null,null,null,null,null,null,{"$f":"IFERROR(VLOOKUP(D95,Hoja1!$A$3:$B$7,2,FALSE),\"\")","v":""},{"$f":"IFERROR(VLOOKUP(K95,Hoja1!$A$10:$B$12,2,FALSE),\"\")","v":""}]
[null,null,null,null,null,null,null,null,null,null,null,null,null,null,{"$f":"IFERROR(VLOOKUP(D96,Hoja1!$A$3:$B$7,2,FALSE),\"\")","v":""},{"$f":"IFERROR(VLOOKUP(K96,Hoja1!$A$10:$B$12,2,FALSE),\"\")","v":""}]
[null,null,null,null,null,null,null,null,null,null,null,null,null,null,{"$f":"IFERROR(VLOOKUP(D97,Hoja1!$A$3:$B$7,2,FALSE),\"\")","v":""},{"$f":"IFERROR(VLOOKUP(K97,Hoja1!$A$10:$B$12,2,FALSE),\"\")","v":""}]
[null,null,null,null,null,null,null,null,null,null,null,null,null,null,{"$f":"IFERROR(VLOOKUP(D98,Hoja1!$A$3:$B$7,2,FALSE),\"\")","v":""},{"$f":"IFERROR(VLOOKUP(K98,Hoja1!$A$10:$B$12,2,FALSE),\"\")","v":""}]
[null,null,null,null,null,null,null,null,null,null,null,null,null,null,{"$f":"IFERROR(VLOOKUP(D99,Hoja1!$A$3:$B$7,2,FALSE),\"\")","v":""},{"$f":"IFERROR(VLOOKUP(K99,Hoja1!$A$10:$B$12,2,FALSE),\"\")","v":""}]
[null,null,null,null,null,null,null,null,null,null,null,null,null,null,{"$f":"IFERROR(VLOOKUP(D100,Hoja1!$A$3:$B$7,2,FALSE),\"\")","v":""},{"$f":"IFERROR(VLOOKUP(K100,Hoja1!$A$10:$B$12,2,FALSE),\"\")","v":""}]
[null,null,null,null,null,null,null,null,null,null,null,null,null,null,{"$f":"IFERROR(VLOOKUP(D101,Hoja1!$A$3:$B$7,2,FALSE),\"\")","v":""},{"$f":"IFERROR(VLOOKUP(K101,Hoja1!$A$10:$B$12,2,FALSE),\"\")","v":""}]
[null,null,null,null,null,null,null,null,null,null,null,null,null,null,{"$f":"IFERROR(VLOOKUP(D102,Hoja1!$A$3:$B$7,2,FALSE),\"\")","v":""},{"$f":"IFERROR(VLOOKUP(K102,Hoja1!$A$10:$B$12,2,FALSE),\"\")","v":""}]
[null,null,null,null,null,null,null,null,null,null,null,null,null,null,{"$f":"IFERROR(VLOOKUP(D103,Hoja1!$A$3:$B$7,2,FALSE),\"\")","v":""},{"$f":"IFERROR(VLOOKUP(K103,Hoja1!$A$10:$B$12,2,FALSE),\"\")","v":""}]
[null,null,null,null,null,null,null,null,null,null,null,null,null,null,{"$f":"IFERROR(VLOOKUP(D104,Hoja1!$A$3:$B$7,2,FALSE),\"\")","v":""},{"$f":"IFERROR(VLOOKUP(K104,Hoja1!$A$10:$B$12,2,FALSE),\"\")","v":""}]
[null,null,null,null,null,null,null,null,null,null,null,null,null,null,{"$f":"IFERROR(VLOOKUP(D105,Hoja1!$A$3:$B$7,2,FALSE),\"\")","v":""},{"$f":"IFERROR(VLOOKUP(K105,Hoja1!$A$10:$B$12,2,FALSE),\"\")","v":""}]
[null,null,null,null,null,null,null,null,null,null,null,null,null,null,{"$f":"IFERROR(VLOOKUP(D106,Hoja1!$A$3:$B$7,2,FALSE),\"\")","v":""},{"$f":"IFERROR(VLOOKUP(K106,Hoja1!$A$10:$B$12,2,FALSE),\"\")","v":""}]
[null,null,null,null,null,null,null,null,null,null,null,null,null,null,{"$f":"IFERROR(VLOOKUP(D107,Hoja1!$A$3:$B$7,2,FALSE),\"\")","v":""},{"$f":"IFERROR(VLOOKUP(K107,Hoja1!$A$10:$B$12,2,FALSE),\"\")","v":""}]
[null,null,null,null,null,null,null,null,null,null,null,null,null,null,{"$f":"IFERROR(VLOOKUP(D108,Hoja1!$A$3:$B$7,2,FALSE),\"\")","v":""},{"$f":"IFERROR(VLOOKUP(K108,Hoja1!$A$10:$B$12,2,FALSE),\"\")","v":""}]
[null,null,null,null,null,null,null,null,null,null,null,null,null,null,{"$f":"IFERROR(VLOOKUP(D109,Hoja1!$A$3:$B$7,2,FALSE),\"\")","v":""},{"$f":"IFERROR(VLOOKUP(K109,Hoja1!$A$10:$B$12,2,FALSE),\"\")","v":""}]
[null,null,null,null,null,null,null,null,null,null,null,null,null,null,{"$f":"IFERROR(VLOOKUP(D110,Hoja1!$A$3:$B$7,2,FALSE),\"\")","v":""},{"$f":"IFERROR(VLOOKUP(K110,Hoja1!$A$10:$B$12,2,FALSE),\"\")","v":""}]
[null,null,null,null,null,null,null,null,null,null,null,null,null,null,{"$f":"IFERROR(VLOOKUP(D111,Hoja1!$A$3:$B$7,2,FALSE),\"\")","v":""},{"$f":"IFERROR(VLOOKUP(K111,Hoja1!$A$10:$B$12,2,FALSE),\"\")","v":""}]
[null,null,null,null,null,null,null,null,null,null,null,null,null,null,{"$f":"IFERROR(VLOOKUP(D112,Hoja1!$A$3:$B$7,2,FALSE),\"\")","v":""},{"$f":"IFERROR(VLOOKUP(K112,Hoja1!$A$10:$B$12,2,FALSE),\"\")","v":""}]
[null,null,null,null,null,null,null,null,null,null,null,null,null,null,{"$f":"IFERROR(VLOOKUP(D113,Hoja1!$A$3:$B$7,2,FALSE),\"\")","v":""},{"$f":"IFERROR(VLOOKUP(K113,Hoja1!$A$10:$B$12,2,FALSE),\"\")","v":""}]
[null,null,null,null,null,null,null,null,null,null,null,null,null,null,{"$f":"IFERROR(VLOOKUP(D114,Hoja1!$A$3:$B$7,2,FALSE),\"\")","v":""},{"$f":"IFERROR(VLOOKUP(K114,Hoja1!$A$10:$B$12,2,FALSE),\"\")","v":""}]
[null,null,null,null,null,null,null,null,null,null,null,null,null,null,{"$f":"IFERROR(VLOOKUP(D115,Hoja1!$A$3:$B$7,2,FALSE),\"\")","v":""},{"$f":"IFERROR(VLOOKUP(K115,Hoja1!$A$10:$B$12,2,FALSE),\"\")","v":""}]
[null,null,null,null,null,null,null,null,null,null,null,null,null,null,{"$f":"IFERROR(VLOOKUP(D116,Hoja1!$A$3:$B$7,2,FALSE),\"\")","v":""},{"$f":"IFERROR(VLOOKUP(K116,Hoja1!$A$10:$B$12,2,FALSE),\"\")","v":""}]
[null,null,null,null,null,null,null,null,null,null,null,null,null,null,{"$f":"IFERROR(VLOOKUP(D117,Hoja1!$A$3:$B$7,2,FALSE),\"\")","v":""},{"$f":"IFERROR(VLOOKUP(K117,Hoja1!$A$10:$B$12,2,FALSE),\"\")","v":""}]
[null,null,null,null,null,null,null,null,null,null,null,null,null,null,{"$f":"IFERROR(VLOOKUP(D118,Hoja1!$A$3:$B$7,2,FALSE),\"\")","v":""},{"$f":"IFERROR(VLOOKUP(K118,Hoja1!$A$10:$B$12,2,FALSE),\"\")","v":""}]
[null,null,null,null,null,null,null,null,null,null,null,null,null,null,{"$f":"IFERROR(VLOOKUP(D119,Hoja1!$A$3:$B$7,2,FALSE),\"\")","v":""},{"$f":"IFERROR(VLOOKUP(K119,Hoja1!$A$10:$B$12,2,FALSE),\"\")","v":""}]
[null,null,null,null,null,null,null,null,null,null,null,null,null,null,{"$f":"IFERROR(VLOOKUP(D120,Hoja1!$A$3:$B$7,2,FALSE),\"\")","v":""},{"$f":"IFERROR(VLOOKUP(K120,Hoja1!$A$10:$B$12,2,FALSE),\"\")","v":""}]
{"$rows_left_out":887}
{"sheet":"Hoja1","index":1,"n_rows":17,"n_cols":2,"rows_kept":17,"cut":false,"hidden":false,"merged":[]}
[]
["GRUPO PROFESIONAL DEL TRABAJADOR","CÓDIGO DEL GRUPO"]
["Grupo 1",1]
["Grupo 2",2]
["Grupo 3",3]
["Grupo 4",4]
["Grupo 5",5]
[]
["TIPOLOGÍA DE LA ACTIVIDAD","CÓDIGO DE LA ACTIVIDAD"]
["Asesoramiento Integral","AS_INTEGRAL"]
["Asesoramiento Especifico","AS_ESPECIFICO"]
["Asesoramiento Básico","AS_BASICO"]
[]
["LIMITE ANEXO"]
["Personal de asesoría"]
["Personal técnico"]
["Personal administrativo"]