{"text_format":"1","workbook":"xlsx","n_sheets":2,"sheets":["CO","Desplegables"],"not_rendered":{"charts":0,"images":1,"macros":1,"external_links":0,"defined_names":12,"comments":0,"pivot_tables":0},"unopened":[],"bounds":{"document_bytes":16777216,"sheet_cells":100000,"rows_first":2000,"rows_last":500,"rows_between":2000,"halvings":0,"cell_chars":16384,"cell_head_chars":4096},"cells_cut":0,"cells_raw":0,"read":"whole","date_system":"1900"}

{"sheet":"CO","index":0,"n_rows":621,"n_cols":19,"rows_kept":621,"cut":false,"hidden":false,"merged":[[7,10,7,13],[7,0,8,0],[7,1,8,1],[7,2,8,2],[7,3,8,3],[7,4,7,9],[2,0,2,13],[1,0,1,13],[3,12,3,13],[4,11,5,11],[4,12,5,13],[4,0,5,1],[3,0,3,1],[4,2,5,10],[3,2,3,10]]}
[]
["RELACIÓN DE OFERTAS PRESENTADAS Y ELEGIDAS"]
["DATOS DE LA ENTIDAD SOLICITANTE"]
["RAZÓN SOCIAL:",null,null,null,null,null,null,null,null,null,null,"NIF:"]
["NOMBRE DE LA PROPUPESTA DE ACTIVIDADES DE SERVICIOS DE ASESORAMIENTO: ",null,null,null,null,null,null,null,null,null,null,"PROGRAMA:"]
[]
[]
["Nº Orden según el Cuadro Repertoriado","Actividad para la que se requiere\n","Conceptos de gasto de cada actividad","Límite anexo","Ofertas solicitadas",null,null,null,null,null,"Ofertas elegidas"]
[null,null,null,null,"Proveedor","Pais","NIF","Codigo pais NIF","Importe (sin IVA) euros","Importe (con IVA) euros","Proveedor seleccionado","Criterio de selección","Se adjunta memoria (Sí/No)","Requiere autorización art. 29 de la Ley General de Subvenciones (Sí/no)"]
[null,null,null,null,null,null,null,{"$f":"IF(AND(F10<>\"\",G10<>\"\"),VLOOKUP(F10,Desplegables!$E$2:$F$275,2,0)&G10,\"\")","v":""},null,null,null,null,null,null,null,{"$f":"IF(C10<>\"\",VLOOKUP(C10,Desplegables!$A$3:$B$12,2,0),\"\")","v":""},{"$f":"IF(D10<>\"\",VLOOKUP(D10,Desplegables!$A$26:$C$38,3,0),\"\")","v":""},{"$f":"IF(C10<>\"\",VLOOKUP(C10,Desplegables!$A$3:$C$12,3,0),\"\")","v":""},{"$f":"IF(D10<>\"\",VLOOKUP(D10,Desplegables!$A$12:$B$38,2,0),\"\")","v":""}]
[null,null,null,null,null,null,null,{"$f":"IF(AND(F11<>\"\",G11<>\"\"),VLOOKUP(F11,Desplegables!$E$2:$F$275,2,0)&G11,\"\")","v":""},null,null,null,null,null,null,null,{"$f":"IF(C11<>\"\",VLOOKUP(C11,Desplegables!$A$3:$B$12,2,0),\"\")","v":""},{"$f":"IF(D11<>\"\",VLOOKUP(D11,Desplegables!$A$26:$C$38,3,0),\"\")","v":""},{"$f":"IF(C11<>\"\",VLOOKUP(C11,Desplegables!$A$3:$C$12,3,0),\"\")","v":""},{"$f":"IF(D11<>\"\",VLOOKUP(D11,Desplegables!$A$12:$B$38,2,0),\"\")","v":""}]
[null,null,null,null,null,null,null,{"$f":"IF(AND(F12<>\"\",G12<>\"\"),VLOOKUP(F12,Desplegables!$E$2:$F$275,2,0)&G12,\"\")","v":""},null,null,null,null,null,null,null,{"$f":"IF(C12<>\"\",VLOOKUP(C12,Desplegables!$A$3:$B$12,2,0),\"\")","v":""},{"$f":"IF(D12<>\"\",VLOOKUP(D12,Desplegables!$A$26:$C$38,3,0),\"\")","v":""},{"$f":"IF(C12<>\"\",VLOOKUP(C12,Desplegables!$A$3:$C$12,3,0),\"\")","v":""},{"$f":"IF(D12<>\"\",VLOOKUP(D12,Desplegables!$A$12:$B$38,2,0),\"\")","v":""}]
[null,null,null,null,null,null,null,{"$f":"IF(AND(F13<>\"\",G13<>\"\"),VLOOKUP(F13,Desplegables!$E$2:$F$275,2,0)&G13,\"\")","v":""},null,null,null,null,null,null,null,{"$f":"IF(C13<>\"\",VLOOKUP(C13,Desplegables!$A$3:$B$12,2,0),\"\")","v":""},{"$f":"IF(D13<>\"\",VLOOKUP(D13,Desplegables!$A$26:$C$38,3,0),\"\")","v":""},{"$f":"IF(C13<>\"\",VLOOKUP(C13,Desplegables!$A$3:$C$12,3,0),\"\")","v":""},{"$f":"IF(D13<>\"\",VLOOKUP(D13,Desplegables!$A$12:$B$38,2,0),\"\")","v":""}]
[null,null,null,null,null,null,null,{"$f":"IF(AND(F14<>\"\",G14<>\"\"),VLOOKUP(F14,Desplegables!$E$2:$F$275,2,0)&G14,\"\")","v":""},null,null,null,null,null,null,null,{"$f":"IF(C14<>\"\",VLOOKUP(C14,Desplegables!$A$3:$B$12,2,0),\"\")","v":""},{"$f":"IF(D14<>\"\",VLOOKUP(D14,Desplegables!$A$26:$C$38,3,0),\"\")","v":""},{"$f":"IF(C14<>\"\",VLOOKUP(C14,Desplegables!$A$3:$C$12,3,0),\"\")","v":""},{"$f":"IF(D14<>\"\",VLOOKUP(D14,Desplegables!$A$12:$B$38,2,0),\"\")","v":""}]
[null,null,null,null,null,null,null,{"$f":"IF(AND(F15<>\"\",G15<>\"\"),VLOOKUP(F15,Desplegables!$E$2:$F$275,2,0)&G15,\"\")","v":""},null,null,null,null,null,null,null,{"$f":"IF(C15<>\"\",VLOOKUP(C15,Desplegables!$A$3:$B$12,2,0),\"\")","v":""},{"$f":"IF(D15<>\"\",VLOOKUP(D15,Desplegables!$A$26:$C$38,3,0),\"\")","v":""},{"$f":"IF(C15<>\"\",VLOOKUP(C15,Desplegables!$A$3:$C$12,3,0),\"\")","v":""},{"$f":"IF(D15<>\"\",VLOOKUP(D15,Desplegables!$A$12:$B$38,2,0),\"\")","v":""}]
[null,null,null,null,null,null,null,{"$f":"IF(AND(F16<>\"\",G16<>\"\"),VLOOKUP(F16,Desplegables!$E$2:$F$275,2,0)&G16,\"\")","v":""},null,null,null,null,null,null,null,{"$f":"IF(C16<>\"\",VLOOKUP(C16,Desplegables!$A$3:$B$12,2,0),\"\")","v":""},{"$f":"IF(D16<>\"\",VLOOKUP(D16,Desplegables!$A$26:$C$38,3,0),\"\")","v":""},{"$f":"IF(C16<>\"\",VLOOKUP(C16,Desplegables!$A$3:$C$12,3,0),\"\")","v":""},{"$f":"IF(D16<>\"\",VLOOKUP(D16,Desplegables!$A$12:$B$38,2,0),\"\")","v":""}]
[null,null,null,null,null,null,null,{"$f":"IF(AND(F17<>\"\",G17<>\"\"),VLOOKUP(F17,Desplegables!$E$2:$F$275,2,0)&G17,\"\")","v":""},null,null,null,null,null,null,null,{"$f":"IF(C17<>\"\",VLOOKUP(C17,Desplegables!$A$3:$B$12,2,0),\"\")","v":""},{"$f":"IF(D17<>\"\",VLOOKUP(D17,Desplegables!$A$26:$C$38,3,0),\"\")","v":""},{"$f":"IF(C17<>\"\",VLOOKUP(C17,Desplegables!$A$3:$C$12,3,0),\"\")","v":""},{"$f":"IF(D17<>\"\",VLOOKUP(D17,Desplegables!$A$12:$B$38,2,0),\"\")","v":""}]
[null,null,null,null,null,null,null,{"$f":"IF(AND(F18<>\"\",G18<>\"\"),VLOOKUP(F18,Desplegables!$E$2:$F$275,2,0)&G18,\"\")","v":""},null,null,null,null,null,null,null,{"$f":"IF(C18<>\"\",VLOOKUP(C18,Desplegables!$A$3:$B$12,2,0),\"\")","v":""},{"$f":"IF(D18<>\"\",VLOOKUP(D18,Desplegables!$A$26:$C$38,3,0),\"\")","v":""},{"$f":"IF(C18<>\"\",VLOOKUP(C18,Desplegables!$A$3:$C$12,3,0),\"\")","v":""},{"$f":"IF(D18<>\"\",VLOOKUP(D18,Desplegables!$A$12:$B$38,2,0),\"\")","v":""}]
[null,null,null,null,null,null,null,{"$f":"IF(AND(F19<>\"\",G19<>\"\"),VLOOKUP(F19,Desplegables!$E$2:$F$275,2,0)&G19,\"\")","v":""},null,null,null,null,null,null,null,{"$f":"IF(C19<>\"\",VLOOKUP(C19,Desplegables!$A$3:$B$12,2,0),\"\")","v":""},{"$f":"IF(D19<>\"\",VLOOKUP(D19,Desplegables!$A$26:$C$38,3,0),\"\")","v":""},{"$f":"IF(C19<>\"\",VLOOKUP(C19,Desplegables!$A$3:$C$12,3,0),\"\")","v":""},{"$f":"IF(D19<>\"\",VLOOKUP(D19,Desplegables!$A$12:$B$38,2,0),\"\")","v":""}]
[{"$f":"IF(A19<>\"\",A19,\"\")","v":""},{"$f":"IF(B19<>\"\",B19,\"\")","v":""},{"$f":"IF(C19<>\"\",C19,\"\")","v":""},{"$f":"IF(D19<>\"\",D19,\"\")","v":""},null,null,null,{"$f":"IF(AND(F20<>\"\",G20<>\"\"),VLOOKUP(F20,Desplegables!$E$2:$F$275,2,0)&G20,\"\")","v":""},null,null,null,null,null,null,null,{"$f":"IF(C20<>\"\",VLOOKUP(C20,Desplegables!$A$3:$B$12,2,0),\"\")","v":""},{"$f":"IF(D20<>\"\",VLOOKUP(D20,Desplegables!$A$26:$C$38,3,0),\"\")","v":""},{"$f":"IF(C20<>\"\",VLOOKUP(C20,Desplegables!$A$3:$C$12,3,0),\"\")","v":""},{"$f":"IF(D20<>\"\",VLOOKUP(D20,Desplegables!$A$12:$B$38,2,0),\"\")","v":""}]
[{"$f":"IF(A19<>\"\",A19,\"\")","v":""},{"$f":"IF(B19<>\"\",B19,\"\")","v":""},{"$f":"IF(C19<>\"\",C19,\"\")","v":""},{"$f":"IF(D19<>\"\",D19,\"\")","v":""},null,null,null,{"$f":"IF(AND(F21<>\"\",G21<>\"\"),VLOOKUP(F21,Desplegables!$E$2:$F$275,2,0)&G21,\"\")","v":""},null,null,null,null,null,null,null,{"$f":"IF(C21<>\"\",VLOOKUP(C21,Desplegables!$A$3:$B$12,2,0),\"\")","v":""},{"$f":"IF(D21<>\"\",VLOOKUP(D21,Desplegables!$A$26:$C$38,3,0),\"\")","v":""},{"$f":"IF(C21<>\"\",VLOOKUP(C21,Desplegables!$A$3:$C$12,3,0),\"\")","v":""},{"$f":"IF(D21<>\"\",VLOOKUP(D21,Desplegables!$A$12:$B$38,2,0),\"\")","v":""}]
[null,null,null,null,null,null,null,{"$f":"IF(AND(F22<>\"\",G22<>\"\"),VLOOKUP(F22,Desplegables!$E$2:$F$275,2,0)&G22,\"\")","v":""},null,null,null,null,null,null,null,{"$f":"IF(C22<>\"\",VLOOKUP(C22,Desplegables!$A$3:$B$12,2,0),\"\")","v":""},{"$f":"IF(D22<>\"\",VLOOKUP(D22,Desplegables!$A$26:$C$38,3,0),\"\")","v":""},{"$f":"IF(C22<>\"\",VLOOKUP(C22,Desplegables!$A$3:$C$12,3,0),\"\")","v":""},{"$f":"IF(D22<>\"\",VLOOKUP(D22,Desplegables!$A$12:$B$38,2,0),\"\")","v":""}]
[{"$f":"IF(A22<>\"\",A22,\"\")","v":""},{"$f":"IF(B22<>\"\",B22,\"\")","v":""},{"$f":"IF(C22<>\"\",C22,\"\")","v":""},{"$f":"IF(D22<>\"\",D22,\"\")","v":""},null,null,null,{"$f":"IF(AND(F23<>\"\",G23<>\"\"),VLOOKUP(F23,Desplegables!$E$2:$F$275,2,0)&G23,\"\")","v":""},null,null,null,null,null,null,null,{"$f":"IF(C23<>\"\",VLOOKUP(C23,Desplegables!$A$3:$B$12,2,0),\"\")","v":""},{"$f":"IF(D23<>\"\",VLOOKUP(D23,Desplegables!$A$26:$C$38,3,0),\"\")","v":""},{"$f":"IF(C23<>\"\",VLOOKUP(C23,Desplegables!$A$3:$C$12,3,0),\"\")","v":""},{"$f":"IF(D23<>\"\",VLOOKUP(D23,Desplegables!$A$12:$B$38,2,0),\"\")","v":""}]
[{"$f":"IF(A22<>\"\",A22,\"\")","v":""},{"$f":"IF(B22<>\"\",B22,\"\")","v":""},{"$f":"IF(C22<>\"\",C22,\"\")","v":""},{"$f":"IF(D22<>\"\",D22,\"\")","v":""},null,null,null,{"$f":"IF(AND(F24<>\"\",G24<>\"\"),VLOOKUP(F24,Desplegables!$E$2:$F$275,2,0)&G24,\"\")","v":""},null,null,null,null,null,null,null,{"$f":"IF(C24<>\"\",VLOOKUP(C24,Desplegables!$A$3:$B$12,2,0),\"\")","v":""},{"$f":"IF(D24<>\"\",VLOOKUP(D24,Desplegables!$A$26:$C$38,3,0),\"\")","v":""},{"$f":"IF(C24<>\"\",VLOOKUP(C24,Desplegables!$A$3:$C$12,3,0),\"\")","v":""},{"$f":"IF(D24<>\"\",VLOOKUP(D24,Desplegables!$A$12:$B$38,2,0),\"\")","v":""}]
[null,null,null,null,null,null,null,{"$f":"IF(AND(F25<>\"\",G25<>\"\"),VLOOKUP(F25,Desplegables!$E$2:$F$275,2,0)&G25,\"\")","v":""},null,null,null,null,null,null,null,{"$f":"IF(C25<>\"\",VLOOKUP(C25,Desplegables!$A$3:$B$12,2,0),\"\")","v":""},{"$f":"IF(D25<>\"\",VLOOKUP(D25,Desplegables!$A$26:$C$38,3,0),\"\")","v":""},{"$f":"IF(C25<>\"\",VLOOKUP(C25,Desplegables!$A$3:$C$12,3,0),\"\")","v":""},{"$f":"IF(D25<>\"\",VLOOKUP(D25,Desplegables!$A$12:$B$38,2,0),\"\")","v":""}]
[{"$f":"IF(A25<>\"\",A25,\"\")","v":""},{"$f":"IF(B25<>\"\",B25,\"\")","v":""},{"$f":"IF(C25<>\"\",C25,\"\")","v":""},{"$f":"IF(D25<>\"\",D25,\"\")","v":""},null,null,null,{"$f":"IF(AND(F26<>\"\",G26<>\"\"),VLOOKUP(F26,Desplegables!$E$2:$F$275,2,0)&G26,\"\")","v":""},null,null,null,null,null,null,null,{"$f":"IF(C26<>\"\",VLOOKUP(C26,Desplegables!$A$3:$B$12,2,0),\"\")","v":""},{"$f":"IF(D26<>\"\",VLOOKUP(D26,Desplegables!$A$26:$C$38,3,0),\"\")","v":""},{"$f":"IF(C26<>\"\",VLOOKUP(C26,Desplegables!$A$3:$C$12,3,0),\"\")","v":""},{"$f":"IF(D26<>\"\",VLOOKUP(D26,Desplegables!$A$12:$B$38,2,0),\"\")","v":""}]
[{"$f":"IF(A25<>\"\",A25,\"\")","v":""},{"$f":"IF(B25<>\"\",B25,\"\")","v":""},{"$f":"IF(C25<>\"\",C25,\"\")","v":""},{"$f":"IF(D25<>\"\",D25,\"\")","v":""},null,null,null,{"$f":"IF(AND(F27<>\"\",G27<>\"\"),VLOOKUP(F27,Desplegables!$E$2:$F$275,2,0)&G27,\"\")","v":""},null,null,null,null,null,null,null,{"$f":"IF(C27<>\"\",VLOOKUP(C27,Desplegables!$A$3:$B$12,2,0),\"\")","v":""},{"$f":"IF(D27<>\"\",VLOOKUP(D27,Desplegables!$A$26:$C$38,3,0),\"\")","v":""},{"$f":"IF(C27<>\"\",VLOOKUP(C27,Desplegables!$A$3:$C$12,3,0),\"\")","v":""},{"$f":"IF(D27<>\"\",VLOOKUP(D27,Desplegables!$A$12:$B$38,2,0),\"\")","v":""}]
[null,null,null,null,null,null,null,{"$f":"IF(AND(F28<>\"\",G28<>\"\"),VLOOKUP(F28,Desplegables!$E$2:$F$275,2,0)&G28,\"\")","v":""},null,null,null,null,null,null,null,{"$f":"IF(C28<>\"\",VLOOKUP(C28,Desplegables!$A$3:$B$12,2,0),\"\")","v":""},{"$f":"IF(D28<>\"\",VLOOKUP(D28,Desplegables!$A$26:$C$38,3,0),\"\")","v":""},{"$f":"IF(C28<>\"\",VLOOKUP(C28,Desplegables!$A$3:$C$12,3,0),\"\")","v":""},{"$f":"IF(D28<>\"\",VLOOKUP(D28,Desplegables!$A$12:$B$38,2,0),\"\")","v":""}]
[{"$f":"IF(A28<>\"\",A28,\"\")","v":""},{"$f":"IF(B28<>\"\",B28,\"\")","v":""},{"$f":"IF(C28<>\"\",C28,\"\")","v":""},{"$f":"IF(D28<>\"\",D28,\"\")","v":""},null,null,null,{"$f":"IF(AND(F29<>\"\",G29<>\"\"),VLOOKUP(F29,Desplegables!$E$2:$F$275,2,0)&G29,\"\")","v":""},null,null,null,null,null,null,null,{"$f":"IF(C29<>\"\",VLOOKUP(C29,Desplegables!$A$3:$B$12,2,0),\"\")","v":""},{"$f":"IF(D29<>\"\",VLOOKUP(D29,Desplegables!$A$26:$C$38,3,0),\"\")","v":""},{"$f":"IF(C29<>\"\",VLOOKUP(C29,Desplegables!$A$3:$C$12,3,0),\"\")","v":""},{"$f":"IF(D29<>\"\",VLOOKUP(D29,Desplegables!$A$12:$B$38,2,0),\"\")","v":""}]
[{"$f":"IF(A28<>\"\",A28,\"\")","v":""},{"$f":"IF(B28<>\"\",B28,\"\")","v":""},{"$f":"IF(C28<>\"\",C28,\"\")","v":""},{"$f":"IF(D28<>\"\",D28,\"\")","v":""},null,null,null,{"$f":"IF(AND(F30<>\"\",G30<>\"\"),VLOOKUP(F30,Desplegables!$E$2:$F$275,2,0)&G30,\"\")","v":""},null,null,null,null,null,null,null,{"$f":"IF(C30<>\"\",VLOOKUP(C30,Desplegables!$A$3:$B$12,2,0),\"\")","v":""},{"$f":"IF(D30<>\"\",VLOOKUP(D30,Desplegables!$A$26:$C$38,3,0),\"\")","v":""},{"$f":"IF(C30<>\"\",VLOOKUP(C30,Desplegables!$A$3:$C$12,3,0),\"\")","v":""},{"$f":"IF(D30<>\"\",VLOOKUP(D30,Desplegables!$A$12:$B$38,2,0),\"\")","v":""}]
[null,null,null,null,null,null,null,{"$f":"IF(AND(F31<>\"\",G31<>\"\"),VLOOKUP(F31,Desplegables!$E$2:$F$275,2,0)&G31,\"\")","v":""},null,null,null,null,null,null,null,{"$f":"IF(C31<>\"\",VLOOKUP(C31,Desplegables!$A$3:$B$12,2,0),\"\")","v":""},{"$f":"IF(D31<>\"\",VLOOKUP(D31,Desplegables!$A$26:$C$38,3,0),\"\")","v":""},{"$f":"IF(C31<>\"\",VLOOKUP(C31,Desplegables!$A$3:$C$12,3,0),\"\")","v":""},{"$f":"IF(D31<>\"\",VLOOKUP(D31,Desplegables!$A$12:$B$38,2,0),\"\")","v":""}]
[{"$f":"IF(A31<>\"\",A31,\"\")","v":""},{"$f":"IF(B31<>\"\",B31,\"\")","v":""},{"$f":"IF(C31<>\"\",C31,\"\")","v":""},{"$f":"IF(D31<>\"\",D31,\"\")","v":""},null,null,null,{"$f":"IF(AND(F32<>\"\",G32<>\"\"),VLOOKUP(F32,Desplegables!$E$2:$F$275,2,0)&G32,\"\")","v":""},null,null,null,null,null,null,null,{"$f":"IF(C32<>\"\",VLOOKUP(C32,Desplegables!$A$3:$B$12,2,0),\"\")","v":""},{"$f":"IF(D32<>\"\",VLOOKUP(D32,Desplegables!$A$26:$C$38,3,0),\"\")","v":""},{"$f":"IF(C32<>\"\",VLOOKUP(C32,Desplegables!$A$3:$C$12,3,0),\"\")","v":""},{"$f":"IF(D32<>\"\",VLOOKUP(D32,Desplegables!$A$12:$B$38,2,0),\"\")","v":""}]
[{"$f":"IF(A31<>\"\",A31,\"\")","v":""},{"$f":"IF(B31<>\"\",B31,\"\")","v":""},{"$f":"IF(C31<>\"\",C31,\"\")","v":""},{"$f":"IF(D31<>\"\",D31,\"\")","v":""},null,null,null,{"$f":"IF(AND(F33<>\"\",G33<>\"\"),VLOOKUP(F33,Desplegables!$E$2:$F$275,2,0)&G33,\"\")","v":""},null,null,null,null,null,null,null,{"$f":"IF(C33<>\"\",VLOOKUP(C33,Desplegables!$A$3:$B$12,2,0),\"\")","v":""},{"$f":"IF(D33<>\"\",VLOOKUP(D33,Desplegables!$A$26:$C$38,3,0),\"\")","v":""},{"$f":"IF(C33<>\"\",VLOOKUP(C33,Desplegables!$A$3:$C$12,3,0),\"\")","v":""},{"$f":"IF(D33<>\"\",VLOOKUP(D33,Desplegables!$A$12:$B$38,2,0),\"\")","v":""}]
[null,null,null,null,null,null,null,{"$f":"IF(AND(F34<>\"\",G34<>\"\"),VLOOKUP(F34,Desplegables!$E$2:$F$275,2,0)&G34,\"\")","v":""},null,null,null,null,null,null,null,{"$f":"IF(C34<>\"\",VLOOKUP(C34,Desplegables!$A$3:$B$12,2,0),\"\")","v":""},{"$f":"IF(D34<>\"\",VLOOKUP(D34,Desplegables!$A$26:$C$38,3,0),\"\")","v":""},{"$f":"IF(C34<>\"\",VLOOKUP(C34,Desplegables!$A$3:$C$12,3,0),\"\")","v":""},{"$f":"IF(D34<>\"\",VLOOKUP(D34,Desplegables!$A$12:$B$38,2,0),\"\")","v":""}]
[{"$f":"IF(A34<>\"\",A34,\"\")","v":""},{"$f":"IF(B34<>\"\",B34,\"\")","v":""},{"$f":"IF(C34<>\"\",C34,\"\")","v":""},{"$f":"IF(D34<>\"\",D34,\"\")","v":""},null,null,null,{"$f":"IF(AND(F35<>\"\",G35<>\"\"),VLOOKUP(F35,Desplegables!$E$2:$F$275,2,0)&G35,\"\")","v":""},null,null,null,null,null,null,null,{"$f":"IF(C35<>\"\",VLOOKUP(C35,Desplegables!$A$3:$B$12,2,0),\"\")","v":""},{"$f":"IF(D35<>\"\",VLOOKUP(D35,Desplegables!$A$26:$C$38,3,0),\"\")","v":""},{"$f":"IF(C35<>\"\",VLOOKUP(C35,Desplegables!$A$3:$C$12,3,0),\"\")","v":""},{"$f":"IF(D35<>\"\",VLOOKUP(D35,Desplegables!$A$12:$B$38,2,0),\"\")","v":""}]
[{"$f":"IF(A34<>\"\",A34,\"\")","v":""},{"$f":"IF(B34<>\"\",B34,\"\")","v":""},{"$f":"IF(C34<>\"\",C34,\"\")","v":""},{"$f":"IF(D34<>\"\",D34,\"\")","v":""},null,null,null,{"$f":"IF(AND(F36<>\"\",G36<>\"\"),VLOOKUP(F36,Desplegables!$E$2:$F$275,2,0)&G36,\"\")","v":""},null,null,null,null,null,null,null,{"$f":"IF(C36<>\"\",VLOOKUP(C36,Desplegables!$A$3:$B$12,2,0),\"\")","v":""},{"$f":"IF(D36<>\"\",VLOOKUP(D36,Desplegables!$A$26:$C$38,3,0),\"\")","v":""},{"$f":"IF(C36<>\"\",VLOOKUP(C36,Desplegables!$A$3:$C$12,3,0),\"\")","v":""},{"$f":"IF(D36<>\"\",VLOOKUP(D36,Desplegables!$A$12:$B$38,2,0),\"\")","v":""}]
[null,null,null,null,null,null,null,{"$f":"IF(AND(F37<>\"\",G37<>\"\"),VLOOKUP(F37,Desplegables!$E$2:$F$275,2,0)&G37,\"\")","v":""},null,null,null,null,null,null,null,{"$f":"IF(C37<>\"\",VLOOKUP(C37,Desplegables!$A$3:$B$12,2,0),\"\")","v":""},{"$f":"IF(D37<>\"\",VLOOKUP(D37,Desplegables!$A$26:$C$38,3,0),\"\")","v":""},{"$f":"IF(C37<>\"\",VLOOKUP(C37,Desplegables!$A$3:$C$12,3,0),\"\")","v":""},{"$f":"IF(D37<>\"\",VLOOKUP(D37,Desplegables!$A$12:$B$38,2,0),\"\")","v":""}]
[{"$f":"IF(A37<>\"\",A37,\"\")","v":""},{"$f":"IF(B37<>\"\",B37,\"\")","v":""},{"$f":"IF(C37<>\"\",C37,\"\")","v":""},{"$f":"IF(D37<>\"\",D37,\"\")","v":""},null,null,null,{"$f":"IF(AND(F38<>\"\",G38<>\"\"),VLOOKUP(F38,Desplegables!$E$2:$F$275,2,0)&G38,\"\")","v":""},null,null,null,null,null,null,null,{"$f":"IF(C38<>\"\",VLOOKUP(C38,Desplegables!$A$3:$B$12,2,0),\"\")","v":""},{"$f":"IF(D38<>\"\",VLOOKUP(D38,Desplegables!$A$26:$C$38,3,0),\"\")","v":""},{"$f":"IF(C38<>\"\",VLOOKUP(C38,Desplegables!$A$3:$C$12,3,0),\"\")","v":""},{"$f":"IF(D38<>\"\",VLOOKUP(D38,Desplegables!$A$12:$B$38,2,0),\"\")","v":""}]
[{"$f":"IF(A37<>\"\",A37,\"\")","v":""},{"$f":"IF(B37<>\"\",B37,\"\")","v":""},{"$f":"IF(C37<>\"\",C37,\"\")","v":""},{"$f":"IF(D37<>\"\",D37,\"\")","v":""},null,null,null,{"$f":"IF(AND(F39<>\"\",G39<>\"\"),VLOOKUP(F39,Desplegables!$E$2:$F$275,2,0)&G39,\"\")","v":""},null,null,null,null,null,null,null,{"$f":"IF(C39<>\"\",VLOOKUP(C39,Desplegables!$A$3:$B$12,2,0),\"\")","v":""},{"$f":"IF(D39<>\"\",VLOOKUP(D39,Desplegables!$A$26:$C$38,3,0),\"\")","v":""},{"$f":"IF(C39<>\"\",VLOOKUP(C39,Desplegables!$A$3:$C$12,3,0),\"\")","v":""},{"$f":"IF(D39<>\"\",VLOOKUP(D39,Desplegables!$A$12:$B$38,2,0),\"\")","v":""}]
[null,null,null,null,null,null,null,{"$f":"IF(AND(F40<>\"\",G40<>\"\"),VLOOKUP(F40,Desplegables!$E$2:$F$275,2,0)&G40,\"\")","v":""},null,null,null,null,null,null,null,{"$f":"IF(C40<>\"\",VLOOKUP(C40,Desplegables!$A$3:$B$12,2,0),\"\")","v":""},{"$f":"IF(D40<>\"\",VLOOKUP(D40,Desplegables!$A$26:$C$38,3,0),\"\")","v":""},{"$f":"IF(C40<>\"\",VLOOKUP(C40,Desplegables!$A$3:$C$12,3,0),\"\")","v":""},{"$f":"IF(D40<>\"\",VLOOKUP(D40,Desplegables!$A$12:$B$38,2,0),\"\")","v":""}]
{"$rows_left_out":582}
{"sheet":"Desplegables","index":1,"n_rows":275,"n_cols":6,"rows_kept":275,"cut":false,"hidden":false,"merged":[[21,0,21,1]]}
["Cuadro Repertoriado:",null,"\"Concepto de gasto\"",null,"\"Paises\"","\"Codigo Pais\""]
["fichero de carga csv:","\"CÓDIGO CONCEPTO\"","\"CONCEPTO DE GASTO\"",null,"AFGANISTAN","AF"]
["A._Coste_de_personal",1,"A. Coste de personal",null,"ALAND","AX"]
["B1._Gastos_de_transporte_alojamiento_y_manutención",2,"B1. Gastos de transporte, alojamiento y manutención",null,"ALBANIA","AL"]
["B2._Entornos_virtuales",3,"B2. Entornos virtuales",null,"ALEMANIA","DE"]
["B3._Material_de_asesoramiento",4,"B3. Material de asesoramiento",null,"ANDORRA","AD"]
["B3._Servicios_de_contratacion_de_personal",4,"B3. Servicios de contratación de personal",null,"ANGOLA","AO"]
["B4._Licencia_de_actividad",5,"B4. Licencia de actividad",null,"ANGUILA","AI"]
["B4._Seguros",5,"B4. Seguros",null,"ANTARTIDA","AQ"]
["B5._Auditoría",6,"B5. Auditoría",null,"ANTIGUA REPUBLICA YUGOSLAVA DE MACEDONIA","XM"]
["B6._Alquileres",7,"B6. Alquileres",null,"ANTIGUA REPUBLICA YUGOSLAVA DE MACEDONIA","MK"]
["C._Inversiones",8,"C1. Inversiones",null,"ANTIGUA Y BARBUDA","AG"]
[null,null,null,null,"ANTILLAS NEERLANDESAS","AN"]
[null,null,null,null,"ARABIA SAUDI","SA"]
[null,null,null,null,"ARGELIA","DZ"]
[null,null,null,null,"ARGENTINA","AR"]
[null,null,null,null,"ARMENIA","AM"]
[null,null,null,null,"ARUBA","AW"]
[null,null,null,null,"AUSTRALIA","AU"]
[null,null,null,null,"AUSTRIA","AT"]
[null,null,null,null,"AVITUALLAMIENTO Y COMBUSTIBLE","QQ"]
["VALORES PREDETERMINADOS PARA CAMPOS \"Límites\"",null,null,null,"AVITUALLAMIENTOS BUQUES Y AERONAV. NAC","X9"]
[null,null,null,null,"AVI.Y COMB.MARCO INTER. INTRACOMUNITARIO","QR"]
["Cuadro Repertoriado:","\"Límite anexo\"",null,null,"AVI.Y COMB.MARCO INTER.TERCEROS PAISES","QS"]
["fichero de carga csv:",null,null,null,"AZERBAIYAN","AZ"]
["A1_Personal_de_asesoria_externo","A.1 Personal de asesoría externo",51,null,"BAHAMAS","BS"]
["B11_Alojamiento","B.1.1 Alojamiento",55,null,"BAHRAIN","BH"]
["B12_Manutencion","B.1.2 Manutención",56,null,"BANGLADESH","BD"]
["B13_Transporte","B.1.3 Transporte",57,null,"BARBADOS","BB"]
["B21_Entornos_virtuales","B.2.1 Entornos virtuales",58,null,"BELARUS (BIELORUSIA)","BY"]
["B31_Material_de_Asesoramiento","B.3.1 Material de Asesoramiento",59,null,"BELGICA","BE"]
["B31_Servicios_de_Contratacion_de_Personal","B.3.1 Servicios de contratación de personal",60,null,"BELICE","BZ"]
["B41_Licencia_de_Actividad","B.4.1 Licencia de Actividad",62,null,"BENIN","BJ"]
["B41_Seguros","B.4.1 Seguros",61,null,"BERMUDAS","BM"]
["B51_Auditoria","B.5.1 Auditoria",63,null,"BOLIVIA","BO"]
["B61_Alquileres","B.6.1 Alquileres",64,null,"BONAIRE, SAN EUSTAQUIO Y SABA","BQ"]
["C1_Bienes_Inventeables","C.1 Bienes Inventeables",65,null,"BOSNIA Y HERCEGOVINA","BA"]
["C2_Otras_Inversiones","C.2 Otras Inversiones",66,null,"BOTSUANA","BW"]
[null,null,null,null,"BOUVET (ISLA)","BV"]
[null,null,null,null,"BRASIL","BR"]
{"$rows_left_out":235}